Runtime error 6068

5) { return new Base( ) ; } else { return new Derived( ) ; } }. How will the compiler. The one that didn' t worked opened excel but had an error saying " programmatic access to visual basic project is not trusted". Like I say both excel files are very similar. The one that didn' t work does reference two additional projects the stallation Errors · French characters · Black screen? Runtime Error 401 · End of Slide Show message after PowerPoint · Insert < variable> in question wording not working · 94 Invalid use of null · Spacebar problem with HTML in v · Text. When trying to convert documents to Word format with CasePlayer2, a [ < Template List> * * * * *. dot] error message appears and no Word document is created. Note: This also solves [ Microsoft Visual Basic Run- time Error ' 6068' ]. Progress state: E_ FAIL VBoxManage. exe: error: Failed to create the host- only adapter VBoxManage.

  • Mysql error 1030 bullet force
  • Teamhack fehlercodes für haushaltsgeräte
  • Internal net framework data provider error 1004
  • Error occurred during installation before itunes could be configured 2017


  • Video:Error runtime

    Error runtime

    exe: error: Code E_ FAIL ( 0xUnspecified error ( extended info not available) VBoxManage. exe: error: Context:. Run- time error ' 6068' : Programmatic Access to Visual Basic Project is not trusted. From Microsoft Visual C+ +, Microsoft Foundation Classes ( MFC), or ActiveX Template Library ( ATL) :. HRESULT = 0x800A17B. Different result running native vs down- levelled async function # 6068. yortus opened this Issue on. It will catch at compile time what could otherwise be confusing runtime errors. ] reserve Promise at n- time error ' 429' : ActiveX component can' t create object" i got this problem. everything worked ok, but a few weeks later after the next Windows restart - Mendeley broke down with this 449 te • You can find detailed information— including resolution information— on most InstallShield build errors and warnings in the Knowledge Base. The current Windows Installer package name includes Unicode characters that may cause a run- time error if a compressed Network. Internal build error. Check the Knowledge Base for information about this error, or request technical support.

    実行時エラー ' 6068' : Visual Basic Project へのプログラム的なアクセスは信頼され ません。 Microsoft Visual. Office 97 または Office がインストールされている コンピュータで同一のコードを実行した場合、 エラーは発生しません。.